{"text_format":"1","workbook":"xlsx","n_sheets":10,"sheets":["Introduktion","1.1. Nulägesanalys","1.2. Resultat av nulägesanalys","2.1. Viktiga utmaningar","2.2. Möjliga insatser","2.3. Sammanställning","steg 2 - data","clear2","clearnulageinmatning","Variabler"],"not_rendered":{"charts":0,"images":4,"macros":1,"external_links":0,"defined_names":9,"comments":0,"pivot_tables":0},"unopened":[],"bounds":{"document_bytes":16777216,"sheet_cells":100000,"rows_first":2000,"rows_last":500,"rows_between":2000,"halvings":0,"cell_chars":16384,"cell_head_chars":4096},"cells_cut":0,"cells_raw":0,"read":"whole","date_system":"1900"}

{"sheet":"Introduktion","index":0,"n_rows":32,"n_cols":5,"rows_kept":32,"cut":false,"hidden":false,"merged":[[28,1,28,2],[29,1,29,2],[30,1,30,2],[31,1,31,2],[3,1,5,4],[19,1,20,1],[21,1,23,1],[26,1,26,2],[27,1,27,2],[8,1,10,4],[12,1,12,4],[11,1,11,4],[15,1,15,4]]}
[]
[]
[null,"Introduktion till detta verktyg"]
[null,"Denna fil, Verktyg för stärkt patientsäkerhetsarbete i regioner, är utvecklad av Sveriges Kommuner och Regioner tillsammans med  Nationell samverkansgrupp för patientsäkerhet i samverkan med Socialstyrelsen. Syftet är att stödja utvecklingen av en god och säker vård i enlighet med den nationella handlingsplanen för ökad patientsäkerhet. Verktyget innehåller ett stöd för nulägesanalys av patientsäkerhetsarbetet i regionen samt för att identifiera och prioritera bland möjliga förbättringsinsatser för en god och säker vård och omsorg.\n\nVerktyget är ett stöd i två delar: \n- Del 1. Stöd för att genomföra en nulägesanalys av patientsäkerhetsarbetet\n- Del 2. Stöd för att identifiera och prioritera bland möjliga insatser för att stärka patientsäkerhetsarbetet, utifrån resultatet av nulägesanalysen\n\nNotera följande avseende funktionaliteten i verktyget: \n- För full funktionalitet i verktyget är det viktigt att använda knapparna under respektive flik för att ta er mellan flikarna. Detta säkerställer att all information följer med till nästa sida.\n- Det kan ta några sekunder för Excelfilen att ladda när ni klickar er vidare mellan de olika stegen, detta är helt normalt och beror på att information bearbetas från de olika flikarna.\n\nVill ni rensa era svar i verktyget under en viss flik eller i hela dokumentet?\nLängst ned på denna sida finns en knapp för att nollställa hela verktyget. Notera att allt ni fyllt i kommer att raderas om ni väljer att klicka på denna. Om ni enbart vill nollställa det ni fyllt i under en viss flik för att börja om från början, går detta att göra under den enskilda fliken. \n\n\n"]
[]
[]
[]
[null,"Använd det tillhörande genomförandestödet"]
[null,"I genomförandestödet Stärkt patientsäkerhetsarbete i regioner beskrivs hur verktyget är avsett att användas och viktiga begrepp förklaras. I genomförandestödet finns även beskrivningar av de fokusområden, förutsättningar och patientsäkerhetsteman som bygger upp nulägesanalysen. Det är rekommenderat att ta stöd i genomförandestödet såväl under förberedelser som genomförandet.\n\n"]
[]
{"$rows_left_out":23}
{"sheet":"1.1. Nulägesanalys","index":1,"n_rows":450,"n_cols":9,"rows_kept":450,"cut":false,"hidden":false,"merged":[[8,7,33,8],[62,7,71,8],[2,1,2,4],[4,1,4,4],[1,2,1,4],[6,1,6,4],[3,1,3,4],[5,1,5,4],[449,1,451,4]]}
[]
[null," ","Kort instruktion: I denna flik genomför ni er nulägesanalys. Ange först bakgrundsinformation. Tryck på cellen nedan för att välja er region (alternativt organisation). I fälten under fyller ni i vilka aktörer/personer som deltagit i genomförandet samt vilka delar av er hälso- och sjukvård som nulägesanalysen avser, inklusive tidpunkt (exempelvis hela regionen eller ett specifikt verksamhetsområde, VT2021). Se s. 15 i genomförandestödet för exempel på hur det går att organisera arbetet med verktyget."]
[null,"Välj region från listan (alternativt organisation)"]
[null,"Nulägesanalys genomförd av:"]
[null,null,null,null,null,null,null,"A-C-frågor besvarade",{"$f":"COUNTIF($D$14:$D$500,\">\"\"\")","v":0}]
[null,"Nulägesanalysen avser:"]
[null,null,null,null,null,null,null,"A-C-frågor som återstår att besvara",{"$f":"99-I5","v":99}]
[]
[null,null,"Grundläggande förutsättningar för patientsäkerhetsarbete",null,null,null,null,"Forts. instruktion \nEfter att ni fyllt i bakgrundinformationen, påbörja nulägesanalysen.\n1. Besvara frågorna A-C för temat (klicka två gånger på svarsfältet för att se svarsalternativen)\n2. Beskriv i fritextfältet under fråga D en kortfattad förklaring av ert resonemang kring svaren i frågorna A-C  samt notera hinder och möjliggörare som ni ser för ett patientsäkert arbete inom temat \n3. Gå vidare till nästa tema\n4. När hela nulägesanalysen genomförts, gå vidare till resultatet. OBS. Använd knappen \"Visa resultat av nulägesanalys\" för att gå vidare \n\nLästips i genomförandestödet:\n- Instruktioner och tips: s. 22\n- Beskrivningar av teman: s. 42"]
[]
{"$rows_left_out":441}
{"sheet":"1.2. Resultat av nulägesanalys","index":2,"n_rows":46,"n_cols":8,"rows_kept":46,"cut":false,"hidden":false,"merged":[[2,1,2,5],[1,1,1,5],[3,1,3,5],[5,1,5,5],[12,7,15,9],[5,8,5,9],[6,8,6,9],[7,8,7,9],[8,8,8,9],[9,8,9,9]]}
[]
[null,{"$f":"\"Resultat av nulägesanalys, \"&'1.1. Nulägesanalys'!B3:E3&\"\"","v":"Resultat av nulägesanalys, Välj region från listan (alternativt organisation)"}]
[null,{"$f":"\"\"&'1.1. Nulägesanalys'!B5:E5&\"\"","v":""}]
[null,{"$f":"\"\"&'1.1. Nulägesanalys'!B7:E7&\"\"","v":""}]
[]
[null,"Information: Nedan visas resultatet av genomförd nulägesanalys. Om ni vill justera/uppdatera analysen, gå till föregående sida i verktyget (flik 1.1). Om delar av beskrivningen av utmaningar, hinder och möjliggörare är dold går det bra att bredda raderna genom att i vänstermarginalen (se pil) dubbelklicka på strecket mellan raderna. OBS. Använd knappen högst upp till höger för att gå vidare till nästa steg.\nLästips i genomförandestödet: s. 25"]
[]
[null,"\nGrundläggande förutsättningar för patientsäkerhetsarbete","A. Tillräcklig kunskap?","B. Tillräckliga stöd?","C. Används kunskap och stöd?","D. Beskrivning av utmaningar, hinder och möjliggörare"]
[null,{"$f":"'1.1. Nulägesanalys'!C12","v":"Engagerad ledning och tydlig styrning"},{"$f":"IFERROR(VLOOKUP('1.1. Nulägesanalys'!D14,Variabler!$D$3:$E$7,2,FALSE),\"\")","v":""},{"$f":"IFERROR(VLOOKUP('1.1. Nulägesanalys'!D16,Variabler!$D$3:$E$7,2,FALSE),\"\")","v":""},{"$f":"IFERROR(VLOOKUP('1.1. Nulägesanalys'!D18,Variabler!$D$3:$E$7,2,FALSE),\"\")","v":""},{"$f":"IF('1.1. Nulägesanalys'!C21>\"\",'1.1. Nulägesanalys'!C21,\"\")","v":""}]
[null,{"$f":"'1.1. Nulägesanalys'!C25","v":"En god säkerhetskultur"},{"$f":"IFERROR(VLOOKUP('1.1. Nulägesanalys'!D27,Variabler!$D$3:$E$7,2,FALSE),\"\")","v":""},{"$f":"IFERROR(VLOOKUP('1.1. Nulägesanalys'!D29,Variabler!$D$3:$E$7,2,FALSE),\"\")","v":""},{"$f":"IFERROR(VLOOKUP('1.1. Nulägesanalys'!D31,Variabler!$D$3:$E$7,2,FALSE),\"\")","v":""},{"$f":"IF('1.1. Nulägesanalys'!C34>\"\",'1.1. Nulägesanalys'!C34,\"\")","v":""}]
{"$rows_left_out":37}
{"sheet":"2.1. Viktiga utmaningar","index":3,"n_rows":44,"n_cols":9,"rows_kept":44,"cut":false,"hidden":false,"merged":[[1,1,1,6],[2,1,2,6],[3,1,3,6],[5,8,11,9]]}
[]
[null,{"$f":"\"Prioritering av utmaningar, \"&'1.1. Nulägesanalys'!B3:E3&\"\"","v":"Prioritering av utmaningar, Välj region från listan (alternativt organisation)"}]
[null,{"$f":"\"\"&'1.1. Nulägesanalys'!B5:E5&\"\"","v":""}]
[null,{"$f":"\"\"&'1.1. Nulägesanalys'!B7:E7&\"\"","v":""}]
[]
[null,"Grundläggande förutsättningar för patientsäkerhetsarbete","Finns kunskap?","Finns stöd?","Används kunskap och stöd?","D. Beskrivning av utmaningar, hinder och möjliggörare","Välj prioriterade teman:",null,"Kort instruktion:\nPå denna sida markerar ni teman som är prioriterade att ta fram insatser för:\n1. I kolumn G: Välj \"Prioritera\" för dessa teman \n2. Om ni vill kan ni även beskriva de teman ni vill avvakta med, där ni redan genomför arbeten eller där temat är under kontroll (detta är inte nödvändigt för att gå vidare) \n3. Klicka på knappen \"Gå vidare till nästa steg\"\n\nOm delar av beskrivningen av utmaningar, hinder och möjliggörare är dold går det bra att bredda raderna genom att i vänstermarginalen dubbelklicka på strecket mellan raderna.\n\nLästips i genomförandestödet: s. 27"]
[null,{"$f":"'1.2. Resultat av nulägesanalys'!B9","v":"Engagerad ledning och tydlig styrning"},{"$f":"'1.2. Resultat av nulägesanalys'!C9","v":""},{"$f":"'1.2. Resultat av nulägesanalys'!D9","v":""},{"$f":"'1.2. Resultat av nulägesanalys'!E9","v":""},{"$f":"'1.2. Resultat av nulägesanalys'!F9","v":""}]
[null,{"$f":"'1.2. Resultat av nulägesanalys'!B10","v":"En god säkerhetskultur"},{"$f":"'1.2. Resultat av nulägesanalys'!C10","v":""},{"$f":"'1.2. Resultat av nulägesanalys'!D10","v":""},{"$f":"'1.2. Resultat av nulägesanalys'!E10","v":""},{"$f":"'1.2. Resultat av nulägesanalys'!F10","v":""}]
[null,{"$f":"'1.2. Resultat av nulägesanalys'!B11","v":"Adekvat kunskap och kompetens"},{"$f":"'1.2. Resultat av nulägesanalys'!C11","v":""},{"$f":"'1.2. Resultat av nulägesanalys'!D11","v":""},{"$f":"'1.2. Resultat av nulägesanalys'!E11","v":""},{"$f":"'1.2. Resultat av nulägesanalys'!F11","v":""}]
[null,{"$f":"'1.2. Resultat av nulägesanalys'!B12","v":"Patienten som medskapare"},{"$f":"'1.2. Resultat av nulägesanalys'!C12","v":""},{"$f":"'1.2. Resultat av nulägesanalys'!D12","v":""},{"$f":"'1.2. Resultat av nulägesanalys'!E12","v":""},{"$f":"'1.2. Resultat av nulägesanalys'!F12","v":""}]
{"$rows_left_out":35}
{"sheet":"2.2. Möjliga insatser","index":4,"n_rows":67,"n_cols":34,"rows_kept":67,"cut":false,"hidden":false,"merged":[[1,1,1,3],[2,1,2,3],[3,1,3,3],[5,1,7,3],[10,9,16,9]]}
[]
[null,{"$f":"\"Handlingsalternativ, \"&'1.1. Nulägesanalys'!B3:E3&\"\"","v":"Handlingsalternativ, Välj region från listan (alternativt organisation)"},null,null,null,"Prioriterade teman","Prioriterade teman med minst en insats beskriven"]
[null,{"$f":"\"\"&'1.1. Nulägesanalys'!B5:E5&\"\"","v":""},null,null,"Grundläggande förutsättningar",{"$f":"COUNTIF(U11:U19,\">\"\"\")","v":0},{"$f":"COUNTIF(AH11:AH19,\">0\")","v":0},null,null,null,null,null,"Fokusområde 1: Öka kunskap om inträffade vårdskador"]
[null,{"$f":"\"\"&'1.1. Nulägesanalys'!B7:E7&\"\"","v":""},null,null,"Fokusområde 1",{"$f":"COUNTIF(V11:V19,\">\"\"\")","v":0},{"$f":"COUNTIF(AC11:AC19,\">0\")","v":0},null,null,null,null,null,"Fokusområde 2: Tillförlitliga och säkra system och processer "]
[null,null,null,null,"Fokusområde 2",{"$f":"COUNTIF(W11:W19,\">\"\"\")","v":0},{"$f":"COUNTIF(AD11:AD19,\">0\")","v":0},null,null,null,null,null,"Fokusområde 3: Säker vård här och nu"]
[null,"Kort instruktion: På denna sida beskriver ni insatser för era prioriterade teman och uppskattar resursåtgång och förväntad effekt\n1. Välj område i kolumnen nedan (OBS. enbart områden med teman som ni i föregående steg valt att prioritera går att välja)\n2. Välj det tema inom området som ni vill beskriva en insats för (enbart era prioriterade teman går att välja)\n3. Beskriv insatser och aktörer i de grå fritextfälten för ett tema i taget. Det går att välja samma tema flera gånger. \n4. När ni beskrivit insatser för samtliga prioriterade teman - bedöm resursåtgången av att genomföra respektive insats samt den förväntade effekten på patientsäkerheten, gå sedan vidare till sammanställningen \nLästips i genomförandestödet: s. 30",null,null,"Fokusområde 3",{"$f":"COUNTIF(X11:X19,\">\"\"\")","v":0},{"$f":"COUNTIF(AE11:AE19,\">0\")","v":0},null,null,null,null,null,"Fokusområde 4: Stärka analys, lärande och utveckling"]
[null,null,null,null,"Fokusområde 4",{"$f":"COUNTIF(Y11:Y19,\">\"\"\")","v":0},{"$f":"COUNTIF(AF11:AF19,\">0\")","v":0},null,null,null,null,null,"Fokusområde 5: Öka riskmedvetenhet och beredskap"]
[null,null,null,null,"Fokusområde 5",{"$f":"COUNTIF(Z11:Z19,\">\"\"\")","v":0},{"$f":"COUNTIF(AG11:AG19,\">0\")","v":0},null,null,null,null,null,"Grundläggande förutsättningar för patientsäkerhetsarbete",null,null,null,null,null,null,null,null,null,null,null,null,null,null,null,"Ifyllda"]
[null,null,null,null,null,null,null,null,null,null,null,null,"Antal fokusområden",null,{"$f":"COUNTIF($S$11:$S$24,\">\"\"\")","v":0},null,null,null,null,null,"Grundläggande förutsättningar för patientsäkerhetsarbete","Fokusområde 1: Öka kunskap om inträffade vårdskador","Fokusområde 2: Tillförlitliga och säkra system och processer ","Fokusområde 3: Säker vård här och nu","Fokusområde 4: Stärka analys, lärande och utveckling","Fokusområde 5: Öka riskmedvetenhet och beredskap",null,null,"Fokusområde 1: Öka kunskap om inträffade vårdskador","Fokusområde 2: Tillförlitliga och säkra system och processer ","Fokusområde 3: Säker vård här och nu","Fokusområde 4: Stärka analys, lärande och utveckling","Fokusområde 5: Öka riskmedvetenhet och beredskap","Grundläggande förutsättningar för patientsäkerhetsarbete"]
[null,"Välj område","Välj tema","Beskriv insatser för att möta de identifierade utmaningarna","Beskriv vilken/vilka aktörer som bör agera","Uppskattad resursåtgång","Förväntad effekt","Prio-värde",null,null,null,null,"Aktuell lista","Listkolumn","Aktuell listlängd",null,null,null,"Fokusområden","Aktuell lista",1,2,3,4,5,6,null,null,2,3,4,5,6,1]
{"$rows_left_out":58}
{"sheet":"2.3. Sammanställning","index":5,"n_rows":6,"n_cols":10,"rows_kept":6,"cut":false,"hidden":false,"merged":[[1,1,1,7],[2,1,2,7],[3,1,3,7],[5,9,18,12]]}
[]
[null,{"$f":"\"Prioritering av utmaningar, \"&'1.1. Nulägesanalys'!B3:E3&\"\"","v":"Prioritering av utmaningar, Välj region från listan (alternativt organisation)"}]
[null,{"$f":"\"\"&'1.1. Nulägesanalys'!B5:E5&\"\"","v":""}]
[null,{"$f":"\"\"&'1.1. Nulägesanalys'!B7:E7&\"\"","v":""}]
[null,"Område"]
[null,"Område","Tema","Insats","Aktör","Uppskattad resursåtgång","Förväntad effekt","Prio-värde",null,"Information: På denna sida genereras en sammanställning över de insatser ni beskrivit i föregående steg. Använd pilknapparna för att filtrera ut insatser, ex. inom ett visst tema eller för att sortera om insatserna, ex. utifrån lägst resursåtgång/störst effekt. Om viss text är dold, bredda raderna genom att i vänstermarginalen dubbelklicka på strecket mellan raderna.\n\nOBS! Om ni vill ändra formuleringen av insatser/aktör eller bedömning av priovärde, gör uppdateringarna på föregående sida (flik 2.2). Denna sida bör endast användas för att filtrera och sortera i resultatet.\n\nLästips i genomförandestödet: s. 35"]

{"sheet":"steg 2 - data","index":6,"n_rows":54,"n_cols":15,"rows_kept":54,"cut":false,"hidden":true,"merged":[]}
[]
["Antal val",{"$f":"COUNTIF(B5:B19,\">\"\"\")","v":0},null,null,{"$f":"COUNTIF(E5:E19,\">\"\"\")","v":0},null,{"$f":"COUNTIF(G5:G19,\">\"\"\")","v":0},null,{"$f":"COUNTIF(I5:I19,\">\"\"\")","v":0},null,{"$f":"COUNTIF(K5:K19,\">\"\"\")","v":0},null,{"$f":"COUNTIF(M5:M19,\">\"\"\")","v":0},null,{"$f":"COUNTIF(O5:O19,\">\"\"\")","v":0}]
[null,null,null,null,"Grundläggande förutsättningar för patientsäkerhetsarbete",null,"Fokusområde 1: Öka kunskap om inträffade vårdskador",null,"Fokusområde 2: Tillförlitliga och säkra system och processer ",null,"Fokusområde 3: Säker vård här och nu",null,"Fokusområde 4: Stärka analys, lärande och utveckling",null,"Fokusområde 5: Öka riskmedvetenhet och beredskap"]
[null,"Fokusområden","Aktuell lista",null,1,null,2,null,3,null,4,null,5,null,6]
[null,{"$f":"IFERROR(INDEX(B$22:B$33,MATCH(ROW()-ROW($Q$4),A$22:A$33,0)),\"\")","v":""},null,null,{"$f":"IFERROR(INDEX(E$22:E$33,MATCH(ROW()-ROW($Q$4),D$22:D$33,0)),\"\")","v":""},null,{"$f":"IFERROR(INDEX(G$22:G$33,MATCH(ROW()-ROW($Q$4),F$22:F$33,0)),\"\")","v":""},null,{"$f":"IFERROR(INDEX(I$22:I$33,MATCH(ROW()-ROW($Q$4),H$22:H$33,0)),\"\")","v":""},null,{"$f":"IFERROR(INDEX(K$22:K$33,MATCH(ROW()-ROW($Q$4),J$22:J$33,0)),\"\")","v":""},null,{"$f":"IFERROR(INDEX(M$22:M$33,MATCH(ROW()-ROW($Q$4),L$22:L$33,0)),\"\")","v":""},null,{"$f":"IFERROR(INDEX(O$22:O$33,MATCH(ROW()-ROW($Q$4),N$22:N$33,0)),\"\")","v":""}]
[null,{"$f":"IFERROR(INDEX(B$22:B$33,MATCH(ROW()-ROW($Q$4),A$22:A$33,0)),\"\")","v":""},null,null,{"$f":"IFERROR(INDEX(E$22:E$33,MATCH(ROW()-ROW($Q$4),D$22:D$33,0)),\"\")","v":""},null,{"$f":"IFERROR(INDEX(G$22:G$33,MATCH(ROW()-ROW($Q$4),F$22:F$33,0)),\"\")","v":""},null,{"$f":"IFERROR(INDEX(I$22:I$33,MATCH(ROW()-ROW($Q$4),H$22:H$33,0)),\"\")","v":""},null,"",null,{"$f":"IFERROR(INDEX(M$22:M$33,MATCH(ROW()-ROW($Q$4),L$22:L$33,0)),\"\")","v":""},null,{"$f":"IFERROR(INDEX(O$22:O$33,MATCH(ROW()-ROW($Q$4),N$22:N$33,0)),\"\")","v":""}]
[null,"",null,null,"",null,"",null,"",null,"",null,{"$f":"IFERROR(INDEX(M$22:M$33,MATCH(ROW()-ROW($Q$4),L$22:L$33,0)),\"\")","v":""},null,{"$f":"IFERROR(INDEX(O$22:O$33,MATCH(ROW()-ROW($Q$4),N$22:N$33,0)),\"\")","v":""}]
[null,"",null,null,"",null,"",null,"",null,"",null,{"$f":"IFERROR(INDEX(M$22:M$33,MATCH(ROW()-ROW($Q$4),L$22:L$33,0)),\"\")","v":""},null,{"$f":"IFERROR(INDEX(O$22:O$33,MATCH(ROW()-ROW($Q$4),N$22:N$33,0)),\"\")","v":""}]
[null,"",null,null,"",null,"",null,"",null,"",null,{"$f":"IFERROR(INDEX(M$22:M$33,MATCH(ROW()-ROW($Q$4),L$22:L$33,0)),\"\")","v":""},null,{"$f":"IFERROR(INDEX(O$22:O$33,MATCH(ROW()-ROW($Q$4),N$22:N$33,0)),\"\")","v":""}]
[null,"",null,null,"",null,"",null,"",null,"",null,{"$f":"IFERROR(INDEX(M$22:M$33,MATCH(ROW()-ROW($Q$4),L$22:L$33,0)),\"\")","v":""},null,{"$f":"IFERROR(INDEX(O$22:O$33,MATCH(ROW()-ROW($Q$4),N$22:N$33,0)),\"\")","v":""}]
{"$rows_left_out":45}
{"sheet":"clear2","index":7,"n_rows":62,"n_cols":8,"rows_kept":62,"cut":false,"hidden":true,"merged":[[1,1,1,3],[2,1,2,3]]}
[]
[null,{"$f":"\"Handlingsalternativ, \"&'1.1. Nulägesanalys'!B3:E3&\"\"","v":"Handlingsalternativ, Välj region från listan (alternativt organisation)"}]
[null,{"$f":"\"\"&'1.1. Nulägesanalys'!B5:E5&\"\"","v":""}]
[]
[null,"Välj område","Välj tema","Beskriv insatser för att möta de identifierade utmaningarna","Beskriv vilken/vilka aktörer som bör agera","Uppskattad resursåtgång","Förväntad effekt","Prio-värde"]
[null,null,null,null,null,null,null,{"$f":"IFERROR(VLOOKUP(F6,Variabler!$C$33:$D$35,2,FALSE)+VLOOKUP(G6,Variabler!$E$33:$F$36,2,FALSE),\"\")","v":""}]
[null,null,null,null,null,null,null,{"$f":"IFERROR(VLOOKUP(F7,Variabler!$C$33:$D$35,2,FALSE)+VLOOKUP(G7,Variabler!$E$33:$F$36,2,FALSE),\"\")","v":""}]
[null,null,null,null,null,null,null,{"$f":"IFERROR(VLOOKUP(F8,Variabler!$C$33:$D$35,2,FALSE)+VLOOKUP(G8,Variabler!$E$33:$F$36,2,FALSE),\"\")","v":""}]
[null,null,null,null,null,null,null,{"$f":"IFERROR(VLOOKUP(F9,Variabler!$C$33:$D$35,2,FALSE)+VLOOKUP(G9,Variabler!$E$33:$F$36,2,FALSE),\"\")","v":""}]
[null,null,null,null,null,null,null,{"$f":"IFERROR(VLOOKUP(F10,Variabler!$C$33:$D$35,2,FALSE)+VLOOKUP(G10,Variabler!$E$33:$F$36,2,FALSE),\"\")","v":""}]
{"$rows_left_out":53}
{"sheet":"clearnulageinmatning","index":8,"n_rows":446,"n_cols":9,"rows_kept":446,"cut":false,"hidden":true,"merged":[[1,2,1,4],[2,1,2,4],[4,1,4,4],[6,1,6,4],[11,7,26,8],[3,1,3,4],[5,1,5,4]]}
[]
[null," ","Kort instruktion: I denna flik genomför ni er nulägesanalys. Ange först bakgrundsinformation. Tryck på cellen nedan för att välja er region (alternativt organisation). I fälten under fyller ni i vilka aktörer/personer som deltagit i genomförandet samt vilka delar av er hälso- och sjukvård som nulägesanalysen avser, inklusive tidpunkt (exempelvis hela regionen eller ett specifikt verksamhetsområde, VT2021). Se s. 15 i genomförandestödet för exempel på hur det går att organisera arbetet med verktyget."]
[null,"Välj region från listan (alternativt organisation)"]
[null,"Nulägesanalys genomförd av:"]
[null,null,null,null,null,null,null,"A-C-frågor besvarade",{"$f":"COUNTIF($D$133:$D$1048576,\">\"\"\")","v":0}]
[null,"Nulägesanalysen avser:"]
[null,null,null,null,null,null,null,"A-C-frågor som återstår att besvara",{"$f":"99-I5","v":99}]
[]
[null,null,"Grundläggande förutsättningar för patientsäkerhetsarbete"]
[]
{"$rows_left_out":437}
{"sheet":"Variabler","index":9,"n_rows":40,"n_cols":9,"rows_kept":40,"cut":false,"hidden":true,"merged":[[0,16,0,21],[1,16,1,21]]}
[]
[null,null,null,"Alternativ","Värde",null,null,null,"Region"]
[null,null,null,"Ja",2,null,null,null,"Välj region från listan (alternativt organisation)"]
[null,null,null,"Ja, i huvudsak ",1,null,null,null,"Region Blekinge"]
[null,null,null,"Till viss del",-1,null,null,null,"Region Dalarna"]
[null,null,null,"Nej",-2,null,null,null,"Region Gotland"]
[null,null,null,"Tillräcklig info saknas",0,null,null,null,"Region Gävleborg"]
[null,null,null,null,null,null,null,null,"Region Halland"]
[null,null,null,null,null,null,null,null,"Region Jämtland Härjedalen"]
[null,null,null,null,null,null,null,null,"Region Jönköpings län"]
{"$rows_left_out":30}